{"text_format":"1","workbook":"xlsx","n_sheets":2,"sheets":["Datos mínimos inversiones inter","ListasDesplegables"],"not_rendered":{"charts":0,"images":3,"macros":1,"external_links":0,"defined_names":2,"comments":1,"pivot_tables":0},"unopened":[],"bounds":{"document_bytes":16777216,"sheet_cells":100000,"rows_first":2000,"rows_last":500,"rows_between":2000,"halvings":0,"cell_chars":16384,"cell_head_chars":4096},"cells_cut":0,"cells_raw":0,"read":"whole","date_system":"1900"}

{"sheet":"Datos mínimos inversiones inter","index":0,"n_rows":81,"n_cols":91,"rows_kept":81,"cut":false,"hidden":false,"merged":[[25,15,25,24],[25,25,25,39],[25,40,25,53],[42,1,42,36],[49,1,49,14],[49,15,49,31],[46,45,46,53],[35,32,35,44],[35,45,35,53],[38,1,38,14],[35,1,35,14],[35,15,35,31],[32,15,32,34],[32,35,32,44],[46,15,46,34],[46,35,46,44],[68,1,68,13],[103,2,103,56],[104,2,104,56],[70,23,70,42],[77,34,77,53],[77,23,77,33],[73,32,73,48],[80,49,80,56],[74,1,74,13],[77,11,77,22],[77,1,77,10],[73,1,73,14],[73,15,73,31],[55,49,55,56],[61,1,61,14],[105,2,105,56],[61,15,61,31],[61,32,61,48],[61,49,61,56],[163,1,163,3],[160,1,160,3],[159,1,159,3],[66,1,66,13],[65,1,65,36],[140,1,140,3],[141,1,141,3],[142,1,142,3],[102,2,102,56],[70,1,70,10],[70,11,70,22],[70,43,70,53],[139,1,139,3],[164,1,164,3],[151,1,151,3],[152,1,152,3],[153,1,153,3],[156,1,156,3],[157,1,157,3],[158,1,158,3],[145,1,145,3],[144,1,144,3],[143,1,143,3],[147,1,147,3],[150,1,150,3],[146,1,146,3],[161,1,161,3],[162,1,162,3],[0,2,0,56],[4,44,4,53],[4,2,4,36],[7,44,7,53],[1,44,3,53],[22,57,22,58],[37,57,60,89],[32,57,32,58],[28,1,28,36],[29,1,29,13],[32,1,32,14],[22,1,22,14],[25,1,25,14],[55,1,55,14],[58,1,58,17],[55,32,55,48],[43,1,43,13],[46,1,46,14],[22,15,22,34],[22,35,22,44],[32,45,32,53],[8,1,8,8],[10,1,10,36],[80,1,80,14],[80,15,80,31],[80,32,80,48],[14,1,14,36],[18,1,18,36],[19,1,19,13],[16,1,16,11],[38,40,38,53],[16,17,16,18],[49,32,49,48],[52,1,52,8],[22,45,22,53],[73,49,73,56],[11,1,11,19]]}
[null,null,"Formato único Compra Venta de Divisas Valores Bancolombia"]
[null,null,null,null,null,null,null,null,null,null,null,null,null,null,null,null,null,null,null,null,null,null,null,null,null,null,null,null,null,null,null,null,null,null,null,null,null,null,null,null,null,null,null,null,"¿Es primera vez que opera divisas por Valores Bancolombia o no realiza operaciones desde el año 2022?"]
[]
[]
[null,null,null,null,null,null,null,null,null,null,null,null,null,null,null,null,null,null,null,null,null,null,null,null,null,null,null,null,null,null,null,null,null,null,null,null,null,null,null,null,null,null,null,null,null,null,null,null,null,null,null,null,null,null,null,null,null,null,1310,null,null,null,null,"CC",null,null,null,null,null,null,null,null,null,null,null,null,null,null,null,null,null,null,null,null,null,null,null,null,null,null,{"$f":"+AS5","v":0}]
[null,null,null,null,null,null,null,null,null,null,null,null,null,null,null,null,null,null,null,null,null,null,null,null,null,null,null,null,null,null,null,null,null,null,null,null,null,null,null,null,null,null,null,null,null,null,null,null,null,null,null,null,null,null,null,null,null,null,null,null,null,null,null,null,null,null,null,null,null,null,null,null,null,null,null,null,null,null,null,null,null,null,null,null,null,null,null,null,null,null,{"$f":"+B12","v":""}]
[null,null,null,null,null,null,null,null,null,null,null,null,null,null,null,null,null,null,null,null,null,null,null,null,null,null,null,null,null,null,null,null,null,null,null,null,null,null,null,null,null,null,null,null,null,"Fecha AAAA-MM-DD",null,null,null,null,null,null,null,null,null,null,null,null,"3- Cambio Declaración de Cambio",null,null,1390,null,null,null,null,"PB",null,null,null,null,null,null,null,null,null,null,null,null,null,null,null,null,null,null,null,null,null,null,null,{"$f":"+B17","v":""}]
[null,null,null,null,null,null,null,null,null,null,null,null,null,null,null,null,null,null,null,null,null,null,null,null,null,null,null,null,null,null,null,null,null,null,null,null,null,null,null,null,null,null,null,null,null,null,null,null,null,null,null,null,null,null,null,null,null,null,null,null,null,null,null,null,null,null,null,null,null,null,null,null,null,null,null,null,null,null,null,null,null,null,null,null,null,null,null,null,null,null,{"$f":"+B53","v":""}]
[null,"¿Reside o vive en Colombia?",null,null,null,null,null,null,null,"",null,null,null,null,null,null,null,null,null,null,null,null,null,null,null,null,null,null,null,null,null,null,null,null,null,null,null,null,null,null,null,null,null,null,null,null,null,null,null,null,null,null,null,null,null,null,null,null,null,null,null,null,null,null,null,null,null,null,null,null,null,null,null,null,null,null,null,null,null,null,null,null,null,null,null,null,null,null,null,null,{"$f":"+IFERROR(VLOOKUP(AJ47,ListasDesplegables!E:F,2,0),\"\")","v":""}]
[null,null,null,null,null,null,null,null,null,null,null,null,null,null,null,null,null,null,null,null,null,null,null,null,null,null,null,null,null,null,null,null,null,null,null,null,null,null,null,null,null,null,null,null,null,null,null,null,null,null,null,null,null,null,null,null,null,null,"E - Egreso",null,null,1598]
[null,"Tipo de Identificación",null,null,null,null,null,null,null,null,null,null,null,null,null,null,null,null,null,null,null,null,null,null,null,null,null,null,null,null,null,null,null,null,null,null,null,null,null,null,null,null,null,null,null,null,null,null,null,null,null,null,null,null,null,null,null,null,null,null,null,null,null,null,null,null,null,null,null,null,null,null,null,null,null,null,null,null,null,null,null,null,null,null,null,null,null,null,null,null,{"$f":"+IFERROR(VLOOKUP(AJ23,ListasDesplegables!E:F,2,0),\"\")","v":""}]
[null,"",null,null,null,null,null,null,null,null,null,null,null,null,null,null,null,null,null,null,null,null,null,null,null,null,null,null,null,null,null,null,null,null,null,null,null,null,null,null,null,null,null,null,null,null,null,null,null,null,null,null,null,null,null,null,null,null,null,null,null,null,null,null,null,null,null,null,null,null,null,null,null,null,null,null,null,null,null,null,null,null,null,null,null,null,null,null,null,null,{"$f":"+IFERROR(IF(P50=\"\",\"\",VLOOKUP(P50,ListasDesplegables!L:M,2,0)),\"N/A\")","v":""}]
[null,null,null,null,null,null,null,null,null,null,null,null,null,null,null,null,null,null,null,null,null,null,null,null,null,null,null,null,null,null,null,null,null,null,null,null,null,null,null,null,null,null,null,null,null,null,null,null,null,null,null,null,null,null,null,null,null,null,null,null,null,4031,null,null,null,null,null,null,null,null,null,null,null,null,null,null,null,null,null,null,null,null,null,null,null,null,null,null,null,null,{"$f":"+IFERROR(IF(AG36=\"\",\"\",VLOOKUP(AG36,ListasDesplegables!L:M,2,0)),\"N/A\")","v":""}]
[null,null,null,null,null,null,null,null,null,null,null,null,null,null,null,null,null,null,null,null,null,null,null,null,null,null,null,null,null,null,null,null,null,null,null,null,null,null,null,null,null,null,null,null,null,null,null,null,null,null,null,null,null,null,null,null,null,null,"Código moneda",null,null,4563]
[null,"Si en el tipo de identificación inidcaste Nit debes indicar si eres una de estas entidades",null,null,null,null,null,null,null,null,null,null,null,null,null,null,null,null,null,null,null,null,null,null,null,null,null,null,null,null,null,null,null,null,null,null,null,null,null,null,null,null,null,null,null,null,null,null,null,null,null,null,null,null,null,null,null,null,"VEF",null,null,4565,null,null,null,null,null,null,null,null,null,null,null,null,null,null,null,null,null,null,null,null,null,null,null,null,null,null,null,null,{"$f":"+IFERROR(VLOOKUP(AJ33,ListasDesplegables!E:F,2,0),\"\")","v":""}]
[null,"Entidad"]
[null,""]
[null,null,null,null,null,null,null,null,null,null,null,null,null,null,null,null,null,null,null,null,null,null,null,null,null,null,null,null,null,null,null,null,null,null,null,null,null,null,null,null,null,null,null,null,null,null,null,null,null,null,null,null,null,null,null,null,null,null,null,null,null,null,null,null,null,null,null,null,null,null,null,null,null,null,null,null,null,null,null,null,null,null,null,null,null,null,null,null,null,null,{"$f":"+IFERROR(VLOOKUP(AJ30,ListasDesplegables!E:F,2,0),\"\")","v":""}]
[]
[null,"Persona Natural Residente"]
[]
[null,"Numero Identificación",null,null,null,null,null,null,null,null,null,null,null,null,null,"Nombre",null,null,null,null,null,null,null,null,null,null,null,null,null,null,null,null,null,null,null,"Ciudad",null,null,null,null,null,null,null,null,null,"Departamento",null,null,null,null,null,null,null,null,null,null,null,null,null,null,null,4585]
[null,null,null,null,null,null,null,null,null,null,null,null,null,null,null,null,null,null,null,null,null,null,null,null,null,null,null,null,null,null,null,null,null,null,null,"",null,null,null,null,null,null,null,null,null,"",null,null,null,null,null,null,null,null,null,null,null,"Relación entre ciudad y departamento",null,null,null,4590]
[]
[null,"Código CIIU",null,null,null,null,null,null,null,null,null,null,null,null,null,"Teléfono",null,null,null,null,null,null,null,null,null,"Dirección",null,null,null,null,null,null,null,null,null,null,null,null,null,null,"Correo"]
[]
[]
[]
[null,"Si en tipo de identificación diligenciaste Nit y en Entidad N/A, por favor diligenciar esta sección"]
[null,"Persona Jurídica Residente"]
[]
[null,"Numero Identificación",null,null,null,null,null,null,null,null,null,null,null,null,null,"Nombre",null,null,null,null,null,null,null,null,null,null,null,null,null,null,null,null,null,null,null,"Ciudad",null,null,null,null,null,null,null,null,null,"Departamento"]
[null,null,null,null,null,null,null,null,null,null,null,null,null,null,null,null,null,null,null,null,null,null,null,null,null,null,null,null,null,null,null,null,null,null,null,"",null,null,null,null,null,null,null,null,null,"",null,null,null,null,null,null,null,null,null,null,null,"lista de banrep."]
[]
[null,"Tipo de Empresa",null,null,null,null,null,null,null,null,null,null,null,null,null,"Sector",null,null,null,null,null,null,null,null,null,null,null,null,null,null,null,null,"Código CIIU",null,null,null,null,null,null,null,null,null,null,null,null,"Tipo Entidad Financiera"]
[null,"",null,null,null,null,null,null,null,null,null,null,null,null,null,"",null,null,null,null,null,null,null,null,null,null,null,null,null,null,null,null,null,null,null,null,null,null,null,null,null,null,null,null,null,"",null,null,null,null,null,null,null,null,null,null,null,"Relacionar tabla de CIIU con Tipo de entidad financiera, si el CIIU no esta en la tabla poner N/A"]
[]
[null,"teléfono",null,null,null,null,null,null,null,null,null,null,null,null,null,"Dirección",null,null,null,null,null,null,null,null,null,null,null,null,null,null,null,null,null,null,null,null,null,null,null,null,"Correo",null,null,null,null,null,null,null,null,null,null,null,null,null,null,null,null,"Falta indicar comentarios en cada casilla"]
[]
[]
[]
[]
[]
[null,"Otra Entidad Sin Personeria Juridica Residente"]
[]
[null,"Numero Identificación",null,null,null,null,null,null,null,null,null,null,null,null,null,"Nombre",null,null,null,null,null,null,null,null,null,null,null,null,null,null,null,null,null,null,null,"Ciudad",null,null,null,null,null,null,null,null,null,"Departamento"]
[null,null,null,null,null,null,null,null,null,null,null,null,null,null,null,null,null,null,null,null,null,null,null,null,null,null,null,null,null,null,null,null,null,null,null,"",null,null,null,null,null,null,null,null,null,""]
[]
[null,"Sector",null,null,null,null,null,null,null,null,null,null,null,null,null,"Código CIIU",null,null,null,null,null,null,null,null,null,null,null,null,null,null,null,null,"Tipo Entidad Financiera"]
[null,"",null,null,null,null,null,null,null,null,null,null,null,null,null,null,null,null,null,null,null,null,null,null,null,null,null,null,null,null,null,null,""]
[]
[null,"Régimen (Solo diligenciar si elige SUC)"]
[null,""]
[]
[null,"Actividad Sucursal Extranjera (Aplica si es regimen Especial o Mixto)"]
[null,""]
[]
[null,"Numero Identificación Administrador "]
[]
[]
{"$rows_left_out":22}
{"sheet":"ListasDesplegables","index":1,"n_rows":1123,"n_cols":23,"rows_kept":1123,"cut":false,"hidden":true,"merged":[]}
["CC- Cédula de Ciudadanía",null,"PAT- Patrimonio Autónomo",null,"Ciudad","Departamento",null,"Tipo de Empresa",null,"Sector",null,"CIIU","Tipo Entidad Financiera",null,"Regimen",null,"Actividad Sucursal Extranjera",null,"Naturaleza",null,"Pais residencia",null,"Si/No"]
["CE- Cédula de Extranjería",null,"FCP- Fondo Capital Privado",null,"ABEJORRAL - 05002","05 ANTIOQUIA ",null,"1-Sociedades / Empresas unipersonales",null,"PR: Privado",null,null,null,null,"1-General",null,"1-Exploración y explotación de hidrocarburos y minería.",null,"1-Persona natural ",null,"AFGANISTÁN-AF",null,"Si"]
["RC- Registro Civil",null,"FIC- Fondo Inversión colectiva",null,"ÁBREGO - 54003","54 NORTE DE SANTANDER",null,"2-Entidades de naturaleza cooperativa",null,"PU: Público",null,6412,"1-Bancos comerciales",null,"2-Especial",null,"2-Presentación de servicios inherentes al sector de hidrocarburos con certificado de dedicación exclusiva",null,"2-Persona Juridica ",null,"ÁLAND-AX",null,"No"]
["NIT- Número de Identificación Tributaria",null,"SUC- Sucursal de sociedad extranjera",null,"ABRIAQUÍ - 05004","05 ANTIOQUIA ",null,"3-Entidad sin ánimo de lucro",null,"MX: Mixto",null,6423,"2-Banca segundo piso",null,"3-Mixto",null,null,null,"3-Otra entidad sin personeria Juridica ",null,"ALBANIA-AL"]
["PB- PASAPORTE",null,"N/A",null,"ACACÍAS - 50006","50 META",null,"4-Entidades gubernamentales del orden \nnacional o territorial",null,null,null,6421,"3-Actividades de corporaciones financieras",null,null,null,null,null,null,null,"ALEMANIA-DE"]
["TI- TARJETA IDENTIDAD",null,null,null,"ACANDÍ - 27006","27 CHOCÓ",null,null,null,null,null,6422,"4-Actividades de compañías de financiamiento",null,null,null,null,null,null,null,"ANDORRA-AD"]
[null,null,null,null,"ACEVEDO - 41006","41 HUILA",null,null,null,null,null,6491,"5-Leasing Financiero (Arrendamiento financiero)",null,null,null,null,null,null,null,"ANGOLA-AO"]
[null,null,null,null,"ACHÍ - 13006","13 BOLÍVAR",null,null,null,null,null,6424,"6-Actividades de cooperativas financieras",null,null,null,null,null,null,null,"ANGUILA-AI"]
[null,null,null,null,"AGRADO - 41013","41 HUILA",null,null,null,null,null,6630,"7-Actividades de administración de fondos",null,null,null,null,null,null,null,"ANTÁRTIDA-AQ"]
[null,null,null,null,"AGUA DE DIOS - 25001","25 CUNDINAMARCA",null,null,null,null,null,5210,"8-Almacenamiento y depósitos",null,null,null,null,null,null,null,"ANTIGUA Y BARBUDA-AG"]
[null,null,null,null,"AGUACHICA - 20011","20 CESAR",null,null,null,null,null,6432,"9-Fondos de cesantías",null,null,null,null,null,null,null,"ANTILLAS HOLANDESAS-AN"]
[null,null,null,null,"AGUADA - 68013","28 SANTANDER",null,null,null,null,null,6496,"10-Capitalizaciones",null,null,null,null,null,null,null,"ARABIA SAUDITA-SA"]
[null,null,null,null,"AGUADAS - 17013","17 CALDAS",null,null,null,null,null,6511,"11-Seguros Generales ",null,null,null,null,null,null,null,"ARGELIA-DZ"]
[null,null,null,null,"AGUAZUL - 85010","85 CASANARE",null,null,null,null,null,6512,"12-Seguros de Vida",null,null,null,null,null,null,null,"ARGENTINA-AR"]
[null,null,null,null,"AGUSTÍN CODAZZI - 20013","20 CESAR",null,null,null,null,null,6513,"13-Reaseguros ",null,null,null,null,null,null,null,"ARMENIA-AM"]
[null,null,null,null,"AIPE - 41016","41 HUILA",null,null,null,null,null,6611,"14-Administración de mercados financieros",null,null,null,null,null,null,null,"ARUBA-AW"]
[null,null,null,null,"ALBÁN - 25019","25 CUNDINAMARCA",null,null,null,null,null,null,null,null,null,null,null,null,null,null,"AUSTRALIA-AU"]
[null,null,null,null,"ALBÁN - 52019","52 NARIÑO",null,null,null,null,null,null,null,null,null,null,null,null,null,null,"AUSTRIA-AT"]
[null,null,null,null,"ALBANIA - 18029","18 CAQUETÁ",null,null,null,null,null,null,null,null,null,null,null,null,null,null,"AZERBAIYÁN-AZ"]
[null,null,null,null,"ALBANIA - 44035","44 LA GUAJIRA",null,null,null,null,null,null,null,null,null,null,null,null,null,null,"BAHAMAS-BS"]
[null,null,null,null,"ALBANIA - 68020","28 SANTANDER",null,null,null,null,null,null,null,null,null,null,null,null,null,null,"BANGLADÉS-BD"]
[null,null,null,null,"ALCALÁ - 76020","76 VALLE DEL CAUCA",null,null,null,null,null,null,null,null,null,null,null,null,null,null,"BARBADOS-BB"]
[null,null,null,null,"ALDANA - 52022","52 NARIÑO",null,null,null,null,null,null,null,null,null,null,null,null,null,null,"BARÉIN-BH"]
[null,null,null,null,"ALEJANDRÍA - 05021","05 ANTIOQUIA ",null,null,null,null,null,null,null,null,null,null,null,null,null,null,"BÉLGICA-BE"]
[null,null,null,null,"ALGARROBO - 47030","47 MAGDALENA",null,null,null,null,null,null,null,null,null,null,null,null,null,null,"BELICE-BZ"]
[null,null,null,null,"ALGECIRAS - 41020","41 HUILA",null,null,null,null,null,null,null,null,null,null,null,null,null,null,"BENÍN-BJ"]
[null,null,null,null,"ALMAGUER - 19022","19 CAUCA",null,null,null,null,null,null,null,null,null,null,null,null,null,null,"BERMUDAS-BM"]
[null,null,null,null,"ALMEIDA - 15022","15 BOYACÁ",null,null,null,null,null,null,null,null,null,null,null,null,null,null,"BIELORRUSIA-BY"]
[null,null,null,null,"ALPUJARRA - 73024","73 TOLIMA",null,null,null,null,null,null,null,null,null,null,null,null,null,null,"BOLIVIA-BO"]
[null,null,null,null,"ALTAMIRA - 41026","41 HUILA",null,null,null,null,null,null,null,null,null,null,null,null,null,null,"BOSNIA Y HERZEGOVINA-BA"]
[null,null,null,null,"ALTO BAUDÓ - 27025","27 CHOCÓ",null,null,null,null,null,null,null,null,null,null,null,null,null,null,"BOTSUANA-BW"]
[null,null,null,null,"ALTOS DEL ROSARIO - 13030","13 BOLÍVAR",null,null,null,null,null,null,null,null,null,null,null,null,null,null,"BRASIL-BR"]
[null,null,null,null,"ALVARADO - 73026","73 TOLIMA",null,null,null,null,null,null,null,null,null,null,null,null,null,null,"BRUNÉI-BN"]
[null,null,null,null,"AMAGÁ - 05030","05 ANTIOQUIA ",null,null,null,null,null,null,null,null,null,null,null,null,null,null,"BULGARIA-BG"]
[null,null,null,null,"AMALFI - 05031","05 ANTIOQUIA ",null,null,null,null,null,null,null,null,null,null,null,null,null,null,"BURKINA FASO-BF"]
[null,null,null,null,"AMBALEMA - 73030","73 TOLIMA",null,null,null,null,null,null,null,null,null,null,null,null,null,null,"BURUNDI-BI"]
[null,null,null,null,"ANAPOIMA - 25035","25 CUNDINAMARCA",null,null,null,null,null,null,null,null,null,null,null,null,null,null,"BUTÁN-BT"]
[null,null,null,null,"ANCUYÁ - 52036","52 NARIÑO",null,null,null,null,null,null,null,null,null,null,null,null,null,null,"CABO VERDE-CV"]
[null,null,null,null,"ANDALUCÍA - 76036","76 VALLE DEL CAUCA",null,null,null,null,null,null,null,null,null,null,null,null,null,null,"CAMBOYA-KH"]
[null,null,null,null,"ANDES - 05034","05 ANTIOQUIA ",null,null,null,null,null,null,null,null,null,null,null,null,null,null,"CAMERÚN-CM"]
[null,null,null,null,"ANGELÓPOLIS - 05036","05 ANTIOQUIA ",null,null,null,null,null,null,null,null,null,null,null,null,null,null,"CANADÁ-CA"]
[null,null,null,null,"ANGOSTURA - 05038","05 ANTIOQUIA ",null,null,null,null,null,null,null,null,null,null,null,null,null,null,"CARIBE NEERLANDÉS-BQ"]
[null,null,null,null,"ANOLAIMA - 25040","25 CUNDINAMARCA",null,null,null,null,null,null,null,null,null,null,null,null,null,null,"CATAR-QA"]
[null,null,null,null,"ANORÍ - 05040","05 ANTIOQUIA ",null,null,null,null,null,null,null,null,null,null,null,null,null,null,"CHAD-TD"]
[null,null,null,null,"ANSERMA - 17042","17 CALDAS",null,null,null,null,null,null,null,null,null,null,null,null,null,null,"CHILE-CL"]
[null,null,null,null,"ANSERMANUEVO - 76041","76 VALLE DEL CAUCA",null,null,null,null,null,null,null,null,null,null,null,null,null,null,"CHINA-CN"]
[null,null,null,null,"ANZÁ - 05044","05 ANTIOQUIA ",null,null,null,null,null,null,null,null,null,null,null,null,null,null,"CHIPRE-CY"]
[null,null,null,null,"ANZOÁTEGUI - 73043","73 TOLIMA",null,null,null,null,null,null,null,null,null,null,null,null,null,null,"CIUDAD DEL VATICANO-VA"]
[null,null,null,null,"APARTADÓ - 05045","05 ANTIOQUIA ",null,null,null,null,null,null,null,null,null,null,null,null,null,null,"COLOMBIA-CO"]
[null,null,null,null,"APÍA - 66045","66 RISARALDA",null,null,null,null,null,null,null,null,null,null,null,null,null,null,"COMORAS-KM"]
[null,null,null,null,"APULO - 25599","25 CUNDINAMARCA",null,null,null,null,null,null,null,null,null,null,null,null,null,null,"COREA DEL NORTE-KP"]
[null,null,null,null,"AQUITANIA - 15047","15 BOYACÁ",null,null,null,null,null,null,null,null,null,null,null,null,null,null,"COREA DEL SUR-KR"]
[null,null,null,null,"ARACATACA - 47053","47 MAGDALENA",null,null,null,null,null,null,null,null,null,null,null,null,null,null,"COSTA DE MARFIL-CI"]
[null,null,null,null,"ARANZAZU - 17050","17 CALDAS",null,null,null,null,null,null,null,null,null,null,null,null,null,null,"COSTA RICA-CR"]
[null,null,null,null,"ARATOCA - 68051","28 SANTANDER",null,null,null,null,null,null,null,null,null,null,null,null,null,null,"CROACIA-HR"]
[null,null,null,null,"ARAUCA - 81001","81 ARAUCA",null,null,null,null,null,null,null,null,null,null,null,null,null,null,"CUBA-CU"]
[null,null,null,null,"ARAUQUITA - 81065","81 ARAUCA",null,null,null,null,null,null,null,null,null,null,null,null,null,null,"CURAZAO-CW"]
[null,null,null,null,"ARBELÁEZ - 25053","25 CUNDINAMARCA",null,null,null,null,null,null,null,null,null,null,null,null,null,null,"DINAMARCA-DK"]
[null,null,null,null,"ARBOLEDA - 52051","52 NARIÑO",null,null,null,null,null,null,null,null,null,null,null,null,null,null,"DOMINICA-DM"]
[null,null,null,null,"ARBOLEDAS - 54051","54 NORTE DE SANTANDER",null,null,null,null,null,null,null,null,null,null,null,null,null,null,"ECUADOR-EC"]
{"$rows_left_out":1063}